Reaction Details
TargetFocal adhesion kinase 1
LigandBDBM50445474
Substrate/Competitorn/a
Meas. Tech.ChEMBL_1284304 (CHEMBL3108325)
IC50 800±n/a nM
Citation El Amrani, MLai, DDebbab, AAly, AHSiems, KSeidel, CSchnekenburger, MGaigneaux, ADiederich, MFeger, DLin, WProksch, P Protein kinase and HDAC inhibitors from the endophytic fungus Epicoccum nigrum. J Nat Prod77:49-56 (2014) 
 
Focal adhesion kinase 1
Name:Focal adhesion kinase 1
Type:Tyrosine-protein kinase
Mol. Mass.:119233.17
Organism:Homo sapiens (Human)
Description:Q05397
Residue:1052
BDBM50445474
NameBDBM50445474
Synonyms:CHEMBL3104855
TypeSmall organic molecule
Emp. Form.C18H14O8
Mol. Mass.358.299
SMILESCc1c(O)c(O)c2oc(cc2c1C=O)-c1c(C)c(O)c(O)c(O)c1C=O