Reaction Details
TargetTyrosine-protein kinase receptor UFO
LigandBDBM50445474
Substrate/Competitorn/a
Meas. Tech.ChEMBL_1284306 (CHEMBL3108327)
IC50 220±n/a nM
Citation El Amrani, MLai, DDebbab, AAly, AHSiems, KSeidel, CSchnekenburger, MGaigneaux, ADiederich, MFeger, DLin, WProksch, P Protein kinase and HDAC inhibitors from the endophytic fungus Epicoccum nigrum. J Nat Prod77:49-56 (2014) 
 
Tyrosine-protein kinase receptor UFO
Name:Tyrosine-protein kinase receptor UFO
Type:Enzyme
Mol. Mass.:98316.97
Organism:Homo sapiens (Human)
Description:P30530
Residue:894
BDBM50445474
NameBDBM50445474
Synonyms:CHEMBL3104855
TypeSmall organic molecule
Emp. Form.C18H14O8
Mol. Mass.358.299
SMILESCc1c(O)c(O)c2oc(cc2c1C=O)-c1c(C)c(O)c(O)c(O)c1C=O