Reaction Details
TargetTyrosine-protein kinase receptor UFO
LigandBDBM50445472
Substrate/Competitorn/a
Meas. Tech.ChEMBL_1284306 (CHEMBL3108327)
IC50 6390±n/a nM
Citation El Amrani, MLai, DDebbab, AAly, AHSiems, KSeidel, CSchnekenburger, MGaigneaux, ADiederich, MFeger, DLin, WProksch, P Protein kinase and HDAC inhibitors from the endophytic fungus Epicoccum nigrum. J Nat Prod77:49-56 (2014) 
 
Tyrosine-protein kinase receptor UFO
Name:Tyrosine-protein kinase receptor UFO
Type:Enzyme
Mol. Mass.:98316.97
Organism:Homo sapiens (Human)
Description:P30530
Residue:894
BDBM50445472
NameBDBM50445472
Synonyms:CHEMBL3104852
TypeSmall organic molecule
Emp. Form.C10H10O6
Mol. Mass.226.1828
SMILESCOC1OC(=O)c2c1c(C)c(O)c(O)c2O