Reaction Details
TargetAurora kinase B
LigandBDBM50445475
Substrate/Competitorn/a
Meas. Tech.ChEMBL_1284305 (CHEMBL3108326)
IC50 8690±n/a nM
Citation El Amrani, MLai, DDebbab, AAly, AHSiems, KSeidel, CSchnekenburger, MGaigneaux, ADiederich, MFeger, DLin, WProksch, P Protein kinase and HDAC inhibitors from the endophytic fungus Epicoccum nigrum. J Nat Prod77:49-56 (2014) 
 
Aurora kinase B
Name:Aurora kinase B
Type:Protein
Mol. Mass.:39327.72
Organism:Homo sapiens (Human)
Description:Q96GD4
Residue:344
BDBM50445475
NameBDBM50445475
Synonyms:CHEMBL3104854
TypeSmall organic molecule
Emp. Form.C9H8O5
Mol. Mass.196.1568
SMILESCc1c2COC(=O)c2c(O)c(O)c1O