Reaction Details
TargetALK tyrosine kinase receptor
LigandBDBM50445474
Substrate/Competitorn/a
Meas. Tech.ChEMBL_1284309 (CHEMBL3108330)
IC50 250±n/a nM
Citation El Amrani, MLai, DDebbab, AAly, AHSiems, KSeidel, CSchnekenburger, MGaigneaux, ADiederich, MFeger, DLin, WProksch, P Protein kinase and HDAC inhibitors from the endophytic fungus Epicoccum nigrum. J Nat Prod77:49-56 (2014) 
 
ALK tyrosine kinase receptor
Name:ALK tyrosine kinase receptor
Type:Protein
Mol. Mass.:176453.10
Organism:Homo sapiens (Human)
Description:Q9UM73
Residue:1620
BDBM50445474
NameBDBM50445474
Synonyms:CHEMBL3104855
TypeSmall organic molecule
Emp. Form.C18H14O8
Mol. Mass.358.299
SMILESCc1c(O)c(O)c2oc(cc2c1C=O)-c1c(C)c(O)c(O)c(O)c1C=O