Reaction Details
TargetSerine/threonine-protein kinase PLK1
LigandBDBM50445471
Substrate/Competitorn/a
Meas. Tech.ChEMBL_1284298 (CHEMBL3108319)
IC50>30000±n/a nM
Citation El Amrani, MLai, DDebbab, AAly, AHSiems, KSeidel, CSchnekenburger, MGaigneaux, ADiederich, MFeger, DLin, WProksch, P Protein kinase and HDAC inhibitors from the endophytic fungus Epicoccum nigrum. J Nat Prod77:49-56 (2014) 
 
Serine/threonine-protein kinase PLK1
Name:Serine/threonine-protein kinase PLK1
Type:Serine/threonine-protein kinase
Mol. Mass.:68277.16
Organism:Homo sapiens (Human)
Description:P53350
Residue:603
BDBM50445471
NameBDBM50445471
Synonyms:CHEMBL3104853
TypeSmall organic molecule
Emp. Form.C10H12O5
Mol. Mass.212.1993
SMILESCOCc1c(C)c(O)c(O)c(O)c1C=O