Reaction Details
TargetSigma non-opioid intracellular receptor 1
LigandBDBM50125099
Substrate/Competitorn/a
Meas. Tech.ChEMBL_1284495 (CHEMBL3106543)
Ki 0.470000±n/a nM
Citation Korpis, KWeber, FBrune, SWünsch, BBednarski, PJ Involvement of apoptosis and autophagy in the death of RPMI 8226 multiple myeloma cells by two enantiomeric sigma receptor ligands. Bioorg Med Chem22:221-33 (2013) 
 
Sigma non-opioid intracellular receptor 1
Name:Sigma non-opioid intracellular receptor 1
Type:Protein
Mol. Mass.:25307.17
Organism:Cavia porcellus (Guinea pig)
Description:Q60492
Residue:223
BDBM50125099
NameBDBM50125099
Synonyms:1-Benzyl-4-(4-methoxy-benzyl)-piperazine CHEMBL163876
TypeSmall organic molecule
Emp. Form.C19H24N2O
Mol. Mass.296.4067
SMILESCOc1ccc(CN2CCN(Cc3ccccc3)CC2)cc1