Reaction Details
TargetHeat shock protein 75 kDa, mitochondrial
LigandBDBM20800
Substrate/Competitorn/a
Meas. Tech.ChEMBL_1284500 (CHEMBL3106548)
Ki 62±n/a nM
Citation Ernst, JTLiu, MZuccola, HNeubert, TBeaumont, KTurnbull, AKallel, AVought, BStamos, D Correlation between chemotype-dependent binding conformations of HSP90a/ß and isoform selectivity-Implications for the structure-based design of HSP90a/ß selective inhibitors for treating neurodegenerative diseases. Bioorg Med Chem Lett24:204-8 (2013) 
 
Heat shock protein 75 kDa, mitochondrial
Name:Heat shock protein 75 kDa, mitochondrial
Type:PROTEIN
Mol. Mass.:80120.13
Organism:Homo sapiens (Human)
Description:ChEMBL_1478164
Residue:704
BDBM20800
NameBDBM20800
Synonyms:2-amino-6-halopurine analogue, 20 CHEMBL467399 | hsp90_107
TypeSmall organic molecule
Emp. Form.C14H15ClN6O
Mol. Mass.318.762
SMILESCOc1c(C)cnc(Cn2cnc3c(Cl)nc(N)nc23)c1C