Reaction Details
TargetAldehyde dehydrogenase 1A1
LigandBDBM50445519
Substrate/Competitorn/a
Meas. Tech.ChEMBL_1285211 (CHEMBL3107142)
IC50 2415±n/a nM
Citation Duveau, DYYasgar, AWang, YHu, XKouznetsova, JBrimacombe, KRJadhav, ASimeonov, AThomas, CJMaloney, DJ Structure-activity relationship studies and biological characterization of human NAD(+)-dependent 15-hydroxyprostaglandin dehydrogenase inhibitors. Bioorg Med Chem Lett24:630-5 (2014) 
 
Aldehyde dehydrogenase 1A1
Name:Aldehyde dehydrogenase 1A1
Type:Protein
Mol. Mass.:54862.21
Organism:Homo sapiens (Human)
Description:n/a
Residue:501
BDBM50445519
NameBDBM50445519
Synonyms:CHEMBL3103035
TypeSmall organic molecule
Emp. Form.C20H18F3N3O
Mol. Mass.373.3716
SMILESFC(F)(F)c1cccc(c1)-n1cnc2cc(ccc12)C(=O)N1CCCCC1