Reaction Details
TargetAldehyde dehydrogenase 1A1
LigandBDBM50445521
Substrate/Competitorn/a
Meas. Tech.ChEMBL_1285211 (CHEMBL3107142)
IC50 1918±n/a nM
Citation Duveau, DYYasgar, AWang, YHu, XKouznetsova, JBrimacombe, KRJadhav, ASimeonov, AThomas, CJMaloney, DJ Structure-activity relationship studies and biological characterization of human NAD(+)-dependent 15-hydroxyprostaglandin dehydrogenase inhibitors. Bioorg Med Chem Lett24:630-5 (2014) 
 
Aldehyde dehydrogenase 1A1
Name:Aldehyde dehydrogenase 1A1
Type:Protein
Mol. Mass.:54862.21
Organism:Homo sapiens (Human)
Description:n/a
Residue:501
BDBM50445521
NameBDBM50445521
Synonyms:CHEMBL3103033 US20230390274, Compound A-6
TypeSmall organic molecule
Emp. Form.C19H18ClN3O
Mol. Mass.339.819
SMILESClc1cccc(c1)-n1cnc2cc(ccc12)C(=O)N1CCCCC1