Reaction Details
TargetAldehyde dehydrogenase 1A1
LigandBDBM50445555
Substrate/Competitorn/a
Meas. Tech.ChEMBL_1285211 (CHEMBL3107142)
IC50 2415±n/a nM
Citation Duveau, DYYasgar, AWang, YHu, XKouznetsova, JBrimacombe, KRJadhav, ASimeonov, AThomas, CJMaloney, DJ Structure-activity relationship studies and biological characterization of human NAD(+)-dependent 15-hydroxyprostaglandin dehydrogenase inhibitors. Bioorg Med Chem Lett24:630-5 (2014) 
 
Aldehyde dehydrogenase 1A1
Name:Aldehyde dehydrogenase 1A1
Type:Protein
Mol. Mass.:54862.21
Organism:Homo sapiens (Human)
Description:n/a
Residue:501
BDBM50445555
NameBDBM50445555
Synonyms:CHEMBL3103000
TypeSmall organic molecule
Emp. Form.C20H24N4
Mol. Mass.320.4314
SMILESCc1cc(c(C)n1-c1ccc(C)cc1)-c1nnc2CCCCCn12