Reaction Details
TargetBotulinum neurotoxin type A
LigandBDBM50445591
Substrate/Competitorn/a
Meas. Tech.ChEMBL_1285734 (CHEMBL3107723)
EC50>300000±n/a nM
Citation Seki, HPellett, SSilhár, PStowe, GNBlanco, BLardy, MAJohnson, EAJanda, KD Synthesis/biological evaluation of hydroxamic acids and their prodrugs as inhibitors for Botulinum neurotoxin A light chain. Bioorg Med Chem22:1208-17 (2014) 
 
Botulinum neurotoxin type A
Name:Botulinum neurotoxin type A
Type:PROTEIN
Mol. Mass.:149450.01
Organism:Clostridium botulinum
Description:ChEMBL_1510137
Residue:1296
BDBM50445591
NameBDBM50445591
Synonyms:CHEMBL3103462
TypeSmall organic molecule
Emp. Form.C27H26Cl2FN3O4
Mol. Mass.546.417
SMILESFc1ccc(CCNC(=O)CC(CC(=O)NOC(=O)NCc2ccccc2)c2ccc(Cl)cc2Cl)cc1