Reaction Details
TargetBotulinum neurotoxin type A
LigandBDBM50445592
Substrate/Competitorn/a
Meas. Tech.ChEMBL_1285734 (CHEMBL3107723)
EC50 198000±n/a nM
Citation Seki, HPellett, SSilhár, PStowe, GNBlanco, BLardy, MAJohnson, EAJanda, KD Synthesis/biological evaluation of hydroxamic acids and their prodrugs as inhibitors for Botulinum neurotoxin A light chain. Bioorg Med Chem22:1208-17 (2014) 
 
Botulinum neurotoxin type A
Name:Botulinum neurotoxin type A
Type:PROTEIN
Mol. Mass.:149450.01
Organism:Clostridium botulinum
Description:ChEMBL_1510137
Residue:1296
BDBM50445592
NameBDBM50445592
Synonyms:CHEMBL3103461
TypeSmall organic molecule
Emp. Form.C25H22BrCl2N3O4
Mol. Mass.579.27
SMILESClc1ccc(C(CC(=O)NOC(=O)NCc2ccccc2)CC(=O)Nc2ccc(Br)cc2)c(Cl)c1