Reaction Details
TargetSeed linoleate 13S-lipoxygenase-1
LigandBDBM50445690
Substrate/Competitorn/a
Meas. Tech.ChEMBL_1284052 (CHEMBL3107209)
Ki 95400±n/a nM
Citation Ribeiro, DFreitas, MTomé, SMSilva, AMPorto, GCabrita, EJMarques, MMFernandes, E Inhibition of LOX by flavonoids: a structure-activity relationship study. Eur J Med Chem72:137-45 (2014) 
 
Seed linoleate 13S-lipoxygenase-1
Name:Seed linoleate 13S-lipoxygenase-1
Type:Enzyme
Mol. Mass.:94365.66
Organism:Glycine max (soybean)
Description:n/a
Residue:839
BDBM50445690
NameBDBM50445690
Synonyms:CHEMBL457821
TypeSmall organic molecule
Emp. Form.C15H10O5
Mol. Mass.270.2369
SMILESOc1cccc(c1)-c1cc(=O)c2c(O)cc(O)cc2o1