Reaction Details
TargetCholinesterase
LigandBDBM50445695
Substrate/Competitorn/a
Meas. Tech.ChEMBL_1284373 (CHEMBL3105939)
IC50 3780±n/a nM
Citation Basiri, AMurugaiyah, VOsman, HKumar, RSKia, YHooda, AParsons, RB Cholinesterase inhibitory activity versus aromatic core multiplicity: a facile green synthesis and molecular docking study of novel piperidone embedded thiazolopyrimidines. Bioorg Med Chem22:906-16 (2014) 
 
Cholinesterase
Name:Cholinesterase
Type:Enzyme
Mol. Mass.:65643.35
Organism:Equus caballus (Horse)
Description:P81908
Residue:574
BDBM50445695
NameBDBM50445695
Synonyms:CHEMBL3104446
TypeSmall organic molecule
Emp. Form.C20H21N3S
Mol. Mass.335.466
SMILESS=C1NC2C(CNC\C2=C/c2ccccc2)C(N1)c1ccccc1