Reaction Details
TargetCholinesterase
LigandBDBM50445708
Substrate/Competitorn/a
Meas. Tech.ChEMBL_1284373 (CHEMBL3105939)
IC50 15770±n/a nM
Citation Basiri, AMurugaiyah, VOsman, HKumar, RSKia, YHooda, AParsons, RB Cholinesterase inhibitory activity versus aromatic core multiplicity: a facile green synthesis and molecular docking study of novel piperidone embedded thiazolopyrimidines. Bioorg Med Chem22:906-16 (2014) 
 
Cholinesterase
Name:Cholinesterase
Type:Enzyme
Mol. Mass.:65643.35
Organism:Equus caballus (Horse)
Description:P81908
Residue:574
BDBM50445708
NameBDBM50445708
Synonyms:CHEMBL3104324
TypeSmall organic molecule
Emp. Form.C28H20F3N3S
Mol. Mass.487.539
SMILESFc1ccc(\C=C2/CNCC3=C2N=C2SC=C(N2C3c2ccc(F)cc2)c2ccc(F)cc2)cc1