Reaction Details
TargetCholinesterase
LigandBDBM50445716
Substrate/Competitorn/a
Meas. Tech.ChEMBL_1284373 (CHEMBL3105939)
IC50 1710±n/a nM
Citation Basiri, AMurugaiyah, VOsman, HKumar, RSKia, YHooda, AParsons, RB Cholinesterase inhibitory activity versus aromatic core multiplicity: a facile green synthesis and molecular docking study of novel piperidone embedded thiazolopyrimidines. Bioorg Med Chem22:906-16 (2014) 
 
Cholinesterase
Name:Cholinesterase
Type:Enzyme
Mol. Mass.:65643.35
Organism:Equus caballus (Horse)
Description:P81908
Residue:574
BDBM50445716
NameBDBM50445716
Synonyms:CHEMBL3104317
TypeSmall organic molecule
Emp. Form.C30H27N3S
Mol. Mass.461.62
SMILESCc1ccc(\C=C2/CNCC3=C2N=C2SC=C(N2C3c2ccc(C)cc2)c2ccccc2)cc1