Reaction Details
TargetAcetylcholinesterase
LigandBDBM50445693
Substrate/Competitorn/a
Meas. Tech.ChEMBL_1284374 (CHEMBL3105940)
IC50 800±n/a nM
Citation Basiri, AMurugaiyah, VOsman, HKumar, RSKia, YHooda, AParsons, RB Cholinesterase inhibitory activity versus aromatic core multiplicity: a facile green synthesis and molecular docking study of novel piperidone embedded thiazolopyrimidines. Bioorg Med Chem22:906-16 (2014) 
 
Acetylcholinesterase
Name:Acetylcholinesterase
Type:Enzyme
Mol. Mass.:71812.79
Organism:Electrophorus electricus (Electric eel)
Description:n/a
Residue:633
BDBM50445693
NameBDBM50445693
Synonyms:CHEMBL3104448
TypeSmall organic molecule
Emp. Form.C22H25N3O2S
Mol. Mass.395.518
SMILESCOc1ccccc1\C=C1/CNCC2C1NC(=S)NC2c1ccccc1OC