Reaction Details
TargetAcetylcholinesterase
LigandBDBM50445703
Substrate/Competitorn/a
Meas. Tech.ChEMBL_1284374 (CHEMBL3105940)
IC50 5370±n/a nM
Citation Basiri, AMurugaiyah, VOsman, HKumar, RSKia, YHooda, AParsons, RB Cholinesterase inhibitory activity versus aromatic core multiplicity: a facile green synthesis and molecular docking study of novel piperidone embedded thiazolopyrimidines. Bioorg Med Chem22:906-16 (2014) 
 
Acetylcholinesterase
Name:Acetylcholinesterase
Type:Enzyme
Mol. Mass.:71812.79
Organism:Electrophorus electricus (Electric eel)
Description:n/a
Residue:633
BDBM50445703
NameBDBM50445703
Synonyms:CHEMBL3104329
TypeSmall organic molecule
Emp. Form.C28H20Cl3N3S
Mol. Mass.536.903
SMILESClc1ccc(\C=C2/CNCC3=C2N=C2SC=C(N2C3c2ccc(Cl)cc2)c2ccc(Cl)cc2)cc1