Reaction Details
TargetAcetylcholinesterase
LigandBDBM50445708
Substrate/Competitorn/a
Meas. Tech.ChEMBL_1284374 (CHEMBL3105940)
IC50 13160±n/a nM
Citation Basiri, AMurugaiyah, VOsman, HKumar, RSKia, YHooda, AParsons, RB Cholinesterase inhibitory activity versus aromatic core multiplicity: a facile green synthesis and molecular docking study of novel piperidone embedded thiazolopyrimidines. Bioorg Med Chem22:906-16 (2014) 
 
Acetylcholinesterase
Name:Acetylcholinesterase
Type:Enzyme
Mol. Mass.:71812.79
Organism:Electrophorus electricus (Electric eel)
Description:n/a
Residue:633
BDBM50445708
NameBDBM50445708
Synonyms:CHEMBL3104324
TypeSmall organic molecule
Emp. Form.C28H20F3N3S
Mol. Mass.487.539
SMILESFc1ccc(\C=C2/CNCC3=C2N=C2SC=C(N2C3c2ccc(F)cc2)c2ccc(F)cc2)cc1