Reaction Details
TargetAcetylcholinesterase
LigandBDBM50445712
Substrate/Competitorn/a
Meas. Tech.ChEMBL_1284374 (CHEMBL3105940)
IC50 6030±n/a nM
Citation Basiri, AMurugaiyah, VOsman, HKumar, RSKia, YHooda, AParsons, RB Cholinesterase inhibitory activity versus aromatic core multiplicity: a facile green synthesis and molecular docking study of novel piperidone embedded thiazolopyrimidines. Bioorg Med Chem22:906-16 (2014) 
 
Acetylcholinesterase
Name:Acetylcholinesterase
Type:Enzyme
Mol. Mass.:71812.79
Organism:Electrophorus electricus (Electric eel)
Description:n/a
Residue:633
BDBM50445712
NameBDBM50445712
Synonyms:CHEMBL3104320
TypeSmall organic molecule
Emp. Form.C28H20Cl2FN3S
Mol. Mass.520.448
SMILESFc1ccc(cc1)C1=CSC2=NC3=C(CNC\C3=C/c3ccccc3Cl)C(N12)c1ccccc1Cl