Reaction Details
TargetPoly [ADP-ribose] polymerase 1
LigandBDBM50445853
Substrate/Competitorn/a
Meas. Tech.ChEMBL_1285751 (CHEMBL3107875)
IC50 43±n/a nM
Citation Giannini, GBattistuzzi, GVesci, LMilazzo, FMDe Paolis, FBarbarino, MGuglielmi, MBCarollo, VGallo, GArtali, RDallavalle, S Novel PARP-1 inhibitors based on a 2-propanoyl-3H-quinazolin-4-one scaffold. Bioorg Med Chem Lett24:462-6 (2014) 
 
Poly [ADP-ribose] polymerase 1
Name:Poly [ADP-ribose] polymerase 1
Type:n/a
Mol. Mass.:113114.22
Organism:Homo sapiens (Human)
Description:P09874
Residue:1014
BDBM50445853
NameBDBM50445853
Synonyms:CHEMBL1544030
TypeSmall organic molecule
Emp. Form.C18H18N2O3
Mol. Mass.310.3471
SMILESNC(=O)c1ccccc1OCC(=O)N1CCc2ccccc2C1