Reaction Details
TargetNuclear receptor ROR-gamma
LigandBDBM50445877
Substrate/Competitorn/a
Meas. Tech.ChEMBL_1285940 (CHEMBL3106083)
Ki 40±n/a nM
Citation Wang, YCai, WZhang, GYang, TLiu, QCheng, YZhou, LMa, YCheng, ZLu, SZhao, YGZhang, WXiang, ZWang, SYang, LWu, QOrband-Miller, LAXu, YZhang, JGao, RHuxdorf, MXiang, JNZhong, ZElliott, JDLeung, SLin, X Discovery of novel N-(5-(arylcarbonyl)thiazol-2-yl)amides and N-(5-(arylcarbonyl)thiophen-2-yl)amides as potent ROR¿t inhibitors. Bioorg Med Chem22:692-702 (2014) 
 
Nuclear receptor ROR-gamma
Name:Nuclear receptor ROR-gamma
Type:Enzyme Catalytic Domain
Mol. Mass.:58218.40
Organism:Homo sapiens (Human)
Description:P51449
Residue:518
BDBM50445877
NameBDBM50445877
Synonyms:CHEMBL3105681
TypeSmall organic molecule
Emp. Form.C26H20Cl2N2O4S2
Mol. Mass.559.484
SMILESCCS(=O)(=O)c1ccc(CC(=O)Nc2nc(c(s2)C(=O)c2ccccc2Cl)-c2cccc(Cl)c2)cc1