Reaction Details
Target6-phosphofructo-2-kinase/fructose-2,6-bisphosphatase 3
LigandBDBM50209568
Substrate/Competitorn/a
Meas. Tech.ChEMBL_1286130 (CHEMBL3106987)
IC50 670±n/a nM
Citation Brooke, DGvan Dam, EMWatts, CKKhoury, ADziadek, MABrooks, HGraham, LJFlanagan, JUDenny, WA Targeting the Warburg Effect in cancer; relationships for 2-arylpyridazinones as inhibitors of the key glycolytic enzyme 6-phosphofructo-2-kinase/2,6-bisphosphatase 3 (PFKFB3). Bioorg Med Chem22:1029-39 (2014) 
 
6-phosphofructo-2-kinase/fructose-2,6-bisphosphatase 3
Name:6-phosphofructo-2-kinase/fructose-2,6-bisphosphatase 3
Type:Enzyme
Mol. Mass.:59620.59
Organism:Homo sapiens (Human)
Description:Q16875
Residue:520
BDBM50209568
NameBDBM50209568
Synonyms:4',7,8-trihydroxyisoflavone 7,8-dihydroxy-3-(4-hydroxyphenyl)-4H-chromen-4-one IR-301
TypeSmall organic molecule
Emp. Form.C15H10O5
Mol. Mass.270.2369
SMILESOc1ccc(cc1)-c1coc2c(O)c(O)ccc2c1=O