Reaction Details
Target6-phosphofructo-2-kinase/fructose-2,6-bisphosphatase 3
LigandBDBM50445948
Substrate/Competitorn/a
Meas. Tech.ChEMBL_1286130 (CHEMBL3106987)
IC50 25000±n/a nM
Citation Brooke, DGvan Dam, EMWatts, CKKhoury, ADziadek, MABrooks, HGraham, LJFlanagan, JUDenny, WA Targeting the Warburg Effect in cancer; relationships for 2-arylpyridazinones as inhibitors of the key glycolytic enzyme 6-phosphofructo-2-kinase/2,6-bisphosphatase 3 (PFKFB3). Bioorg Med Chem22:1029-39 (2014) 
 
6-phosphofructo-2-kinase/fructose-2,6-bisphosphatase 3
Name:6-phosphofructo-2-kinase/fructose-2,6-bisphosphatase 3
Type:Enzyme
Mol. Mass.:59620.59
Organism:Homo sapiens (Human)
Description:Q16875
Residue:520
BDBM50445948
NameBDBM50445948
Synonyms:CHEMBL3105848
TypeSmall organic molecule
Emp. Form.C13H10N2O
Mol. Mass.210.2313
SMILESO=C(\C=C\c1cccnc1)c1ccncc1