Reaction Details
TargetGlutamate receptor ionotropic, NMDA 2B
LigandBDBM50083351
Substrate/Competitorn/a
Meas. Tech.ChEMBL_1283718 (CHEMBL3108298)
IC50 20±n/a nM
Citation Gitto, RDe Luca, LFerro, SRusso, EDe Sarro, GChisari, MCiranna, LAlvarez-Builla, JAlajarin, RBuemi, MRChimirri, A Synthesis, modelling and biological characterization of 3-substituted-1H-indoles as ligands of GluN2B-containing N-methyl-d-aspartate receptors. Bioorg Med Chem22:1040-8 (2014) 
 
Glutamate receptor ionotropic, NMDA 2B
Name:Glutamate receptor ionotropic, NMDA 2B
Type:Protein
Mol. Mass.:166077.66
Organism:Rattus norvegicus (Rat)
Description:Q00960
Residue:1482
BDBM50083351
NameBDBM50083351
Synonyms:(+/-)-[2-(4-benzylpiperidino)-1-(4-hydroxyphenyl)-1-propanol] 4-(2-(4-benzylpiperidin-1-yl)-1-hydroxypropyl)phenol CHEMBL305187 IFENPRODIL
TypeSmall organic molecule
Emp. Form.C21H27NO2
Mol. Mass.325.4446
SMILESCC(C(O)c1ccc(O)cc1)N1CCC(Cc2ccccc2)CC1