Reaction Details
TargetAldo-keto reductase family 1 member C4
LigandBDBM50446022
Substrate/Competitorn/a
Meas. Tech.ChEMBL_1283743 (CHEMBL3108468)
IC50>30000±n/a nM
Citation Flanagan, JUAtwell, GJHeinrich, DMBrooke, DGSilva, SRigoreau, LJTrivier, ETurnbull, APRaynham, TJamieson, SMDenny, WA Morpholylureas are a new class of potent and selective inhibitors of the type 5 17-ß-hydroxysteroid dehydrogenase (AKR1C3). Bioorg Med Chem22:967-77 (2014) 
 
Aldo-keto reductase family 1 member C4
Name:Aldo-keto reductase family 1 member C4
Type:Enzyme
Mol. Mass.:37068.40
Organism:Homo sapiens (Human)
Description:P17516
Residue:323
BDBM50446022
NameBDBM50446022
Synonyms:CHEMBL3103335
TypeSmall organic molecule
Emp. Form.C16H22ClN3O2
Mol. Mass.323.818
SMILESClc1ccc(CN2CCN(CC2)C(=O)N2CCOCC2)cc1