Reaction Details
TargetAldo-keto reductase family 1 member C4
LigandBDBM50446023
Substrate/Competitorn/a
Meas. Tech.ChEMBL_1283743 (CHEMBL3108468)
IC50>30000±n/a nM
Citation Flanagan, JUAtwell, GJHeinrich, DMBrooke, DGSilva, SRigoreau, LJTrivier, ETurnbull, APRaynham, TJamieson, SMDenny, WA Morpholylureas are a new class of potent and selective inhibitors of the type 5 17-ß-hydroxysteroid dehydrogenase (AKR1C3). Bioorg Med Chem22:967-77 (2014) 
 
Aldo-keto reductase family 1 member C4
Name:Aldo-keto reductase family 1 member C4
Type:Enzyme
Mol. Mass.:37068.40
Organism:Homo sapiens (Human)
Description:P17516
Residue:323
BDBM50446023
NameBDBM50446023
Synonyms:CHEMBL3103333
TypeSmall organic molecule
Emp. Form.C14H19ClN4O2
Mol. Mass.310.779
SMILESClc1ccc(cn1)N1CCN(CC1)C(=O)N1CCOCC1