Reaction Details
TargetP2X purinoceptor 4
LigandBDBM50399165
Substrate/Competitorn/a
Meas. Tech.ChEMBL_1283892 (CHEMBL3106505)
IC50 189±n/a nM
Citation Tian, MAbdelrahman, AWeinhausen, SHinz, SWeyer, SDosa, SEl-Tayeb, AMüller, CE Carbamazepine derivatives with P2X4 receptor-blocking activity. Bioorg Med Chem22:1077-88 (2014) 
 
P2X purinoceptor 4
Name:P2X purinoceptor 4
Type:Enzyme Catalytic Domain
Mol. Mass.:43374.70
Organism:Homo sapiens (Human)
Description:Purinergic, P2X4 0 HUMAN::Q99571
Residue:388
BDBM50399165
NameBDBM50399165
Synonyms:CHEMBL2180137
TypeSmall organic molecule
Emp. Form.C20H15NO3
Mol. Mass.317.338
SMILESO=C(OCc1ccccc1)N1c2ccccc2Oc2ccccc12