Reaction Details
TargetP2X purinoceptor 4
LigandBDBM50446068
Substrate/Competitorn/a
Meas. Tech.ChEMBL_1283887 (CHEMBL3106338)
IC50>100000±n/a nM
Citation Tian, MAbdelrahman, AWeinhausen, SHinz, SWeyer, SDosa, SEl-Tayeb, AMüller, CE Carbamazepine derivatives with P2X4 receptor-blocking activity. Bioorg Med Chem22:1077-88 (2014) 
 
P2X purinoceptor 4
Name:P2X purinoceptor 4
Type:PROTEIN
Mol. Mass.:43443.55
Organism:Mus musculus
Description:ChEMBL_1283887
Residue:388
BDBM50446068
NameBDBM50446068
Synonyms:CHEMBL3103375
TypeSmall organic molecule
Emp. Form.C21H24N2O
Mol. Mass.320.4281
SMILESCCCN(CCC)C(=O)N1c2ccccc2C=Cc2ccccc12