Reaction Details
TargetP2X purinoceptor 4
LigandBDBM59268
Substrate/Competitorn/a
Meas. Tech.ChEMBL_1283892 (CHEMBL3106505)
IC50>100000±n/a nM
Citation Tian, MAbdelrahman, AWeinhausen, SHinz, SWeyer, SDosa, SEl-Tayeb, AMüller, CE Carbamazepine derivatives with P2X4 receptor-blocking activity. Bioorg Med Chem22:1077-88 (2014) 
 
P2X purinoceptor 4
Name:P2X purinoceptor 4
Type:Enzyme Catalytic Domain
Mol. Mass.:43374.70
Organism:Homo sapiens (Human)
Description:Purinergic, P2X4 0 HUMAN::Q99571
Residue:388
BDBM59268
NameBDBM59268
Synonyms:10-ethoxy-10,11-dihydro-5H-dibenzo[b,f]azepine-5-carboxamide MLS000532983 cid_2847675
TypeSmall organic molecule
Emp. Form.C17H18N2O2
Mol. Mass.282.337
SMILESCCOC1Cc2ccccc2N(C(N)=O)c2ccccc12