Reaction Details
TargetATP-dependent 6-phosphofructokinase
LigandBDBM50446092
Substrate/Competitorn/a
Meas. Tech.ChEMBL_1288119 (CHEMBL3110579)
IC50 11600±n/a nM
Citation Brimacombe, KRWalsh, MJLiu, LVásquez-Valdivieso, MGMorgan, HPMcNae, IFothergill-Gilmore, LAMichels, PAAuld, DSSimeonov, AWalkinshaw, MDShen, MBoxer, MB Identification of ML251, a Potent Inhibitor of T. brucei and T. cruzi Phosphofructokinase. ACS Med Chem Lett5:12-7 (2014) 
 
ATP-dependent 6-phosphofructokinase
Name:ATP-dependent 6-phosphofructokinase
Type:PROTEIN
Mol. Mass.:53581.09
Organism:Trypanosoma cruzi
Description:ChEMBL_108019
Residue:485
BDBM50446092
NameBDBM50446092
Synonyms:CHEMBL3108866
TypeSmall organic molecule
Emp. Form.C22H21Cl2N3O3S
Mol. Mass.478.391
SMILESCN(C)c1cccc(NS(=O)(=O)c2ccc(NC(=O)Cc3ccc(Cl)c(Cl)c3)cc2)c1