Reaction Details
TargetATP-dependent 6-phosphofructokinase
LigandBDBM50446099
Substrate/Competitorn/a
Meas. Tech.ChEMBL_1288119 (CHEMBL3110579)
IC50 730±n/a nM
Citation Brimacombe, KRWalsh, MJLiu, LVásquez-Valdivieso, MGMorgan, HPMcNae, IFothergill-Gilmore, LAMichels, PAAuld, DSSimeonov, AWalkinshaw, MDShen, MBoxer, MB Identification of ML251, a Potent Inhibitor of T. brucei and T. cruzi Phosphofructokinase. ACS Med Chem Lett5:12-7 (2014) 
 
ATP-dependent 6-phosphofructokinase
Name:ATP-dependent 6-phosphofructokinase
Type:PROTEIN
Mol. Mass.:53581.09
Organism:Trypanosoma cruzi
Description:ChEMBL_108019
Residue:485
BDBM50446099
NameBDBM50446099
Synonyms:CHEMBL3108859
TypeSmall organic molecule
Emp. Form.C17H14Cl2N4O3S
Mol. Mass.425.289
SMILESClc1ccc(CC(=O)Nc2ccc(cc2)S(=O)(=O)Nc2ccn[nH]2)cc1Cl