Reaction Details
TargetATP-dependent 6-phosphofructokinase
LigandBDBM50446094
Substrate/Competitorn/a
Meas. Tech.ChEMBL_1288121 (CHEMBL3110581)
IC50 820±n/a nM
Citation Brimacombe, KRWalsh, MJLiu, LVásquez-Valdivieso, MGMorgan, HPMcNae, IFothergill-Gilmore, LAMichels, PAAuld, DSSimeonov, AWalkinshaw, MDShen, MBoxer, MB Identification of ML251, a Potent Inhibitor of T. brucei and T. cruzi Phosphofructokinase. ACS Med Chem Lett5:12-7 (2014) 
 
ATP-dependent 6-phosphofructokinase
Name:ATP-dependent 6-phosphofructokinase
Type:PROTEIN
Mol. Mass.:53537.94
Organism:Trypanosoma brucei
Description:ChEMBL_1288121
Residue:487
BDBM50446094
NameBDBM50446094
Synonyms:CHEMBL3108864
TypeSmall organic molecule
Emp. Form.C18H14Cl2N4O3S
Mol. Mass.437.3
SMILESClc1ccc(CC(=O)Nc2ccc(cc2)S(=O)(=O)Nc2cncnc2)cc1Cl