Reaction Details
TargetATP-dependent 6-phosphofructokinase
LigandBDBM50446111
Substrate/Competitorn/a
Meas. Tech.ChEMBL_1288121 (CHEMBL3110581)
IC50 730±n/a nM
Citation Brimacombe, KRWalsh, MJLiu, LVásquez-Valdivieso, MGMorgan, HPMcNae, IFothergill-Gilmore, LAMichels, PAAuld, DSSimeonov, AWalkinshaw, MDShen, MBoxer, MB Identification of ML251, a Potent Inhibitor of T. brucei and T. cruzi Phosphofructokinase. ACS Med Chem Lett5:12-7 (2014) 
 
ATP-dependent 6-phosphofructokinase
Name:ATP-dependent 6-phosphofructokinase
Type:PROTEIN
Mol. Mass.:53537.94
Organism:Trypanosoma brucei
Description:ChEMBL_1288121
Residue:487
BDBM50446111
NameBDBM50446111
Synonyms:CHEMBL3108848
TypeSmall organic molecule
Emp. Form.C18H15ClFN3O4S
Mol. Mass.423.846
SMILESCc1cc(NS(=O)(=O)c2ccc(NC(=O)Cc3ccc(F)c(Cl)c3)cc2)no1