Reaction Details
TargetATP-dependent 6-phosphofructokinase
LigandBDBM50446125
Substrate/Competitorn/a
Meas. Tech.ChEMBL_1288121 (CHEMBL3110581)
IC50>57000±n/a nM
Citation Brimacombe, KRWalsh, MJLiu, LVásquez-Valdivieso, MGMorgan, HPMcNae, IFothergill-Gilmore, LAMichels, PAAuld, DSSimeonov, AWalkinshaw, MDShen, MBoxer, MB Identification of ML251, a Potent Inhibitor of T. brucei and T. cruzi Phosphofructokinase. ACS Med Chem Lett5:12-7 (2014) 
 
ATP-dependent 6-phosphofructokinase
Name:ATP-dependent 6-phosphofructokinase
Type:PROTEIN
Mol. Mass.:53537.94
Organism:Trypanosoma brucei
Description:ChEMBL_1288121
Residue:487
BDBM50446125
NameBDBM50446125
Synonyms:CHEMBL3108834
TypeSmall organic molecule
Emp. Form.C16H12Cl2N4O3S
Mol. Mass.411.262
SMILESCc1cc(NC(=O)c2csc(NC(=O)Cc3ccc(Cl)c(Cl)c3)n2)no1