Reaction Details
TargetKallikrein-5 [D153N]
LigandBDBM50446217
Substrate/Competitorn/a
Meas. Tech.ChEMBL_1288000 (CHEMBL3110699)
IC50 479800±n/a nM
Citation Oliveira, JPFreitas, RFMelo, LSBarros, TGSantos, JAJuliano, MAPinheiro, SBlaber, MJuliano, LMuri, EMPuzer, L Isomannide-based peptidomimetics as inhibitors for human tissue kallikreins 5 and 7. ACS Med Chem Lett5:128-32 (2014) 
 
Kallikrein-5 [D153N]
Name:Kallikrein-5 [D153N]
Type:PROTEIN
Mol. Mass.:32031.75
Organism:Homo sapiens (Human)
Description:ChEMBL_1282456
Residue:293
BDBM50446217
NameBDBM50446217
Synonyms:CHEMBL3109167
TypeSmall organic molecule
Emp. Form.C23H34N2O6
Mol. Mass.434.5259
SMILESCC(C)[C@@H](NC(=O)OC(C)(C)C)C(=O)N[C@H]1CO[C@@H]2[C@@H](CO[C@H]12)OCc1ccccc1