Reaction Details
TargetKallikrein-5 [D153N]
LigandBDBM50446222
Substrate/Competitorn/a
Meas. Tech.ChEMBL_1288000 (CHEMBL3110699)
IC50 376600±n/a nM
Citation Oliveira, JPFreitas, RFMelo, LSBarros, TGSantos, JAJuliano, MAPinheiro, SBlaber, MJuliano, LMuri, EMPuzer, L Isomannide-based peptidomimetics as inhibitors for human tissue kallikreins 5 and 7. ACS Med Chem Lett5:128-32 (2014) 
 
Kallikrein-5 [D153N]
Name:Kallikrein-5 [D153N]
Type:PROTEIN
Mol. Mass.:32031.75
Organism:Homo sapiens (Human)
Description:ChEMBL_1282456
Residue:293
BDBM50446222
NameBDBM50446222
Synonyms:CHEMBL3109162
TypeSmall organic molecule
Emp. Form.C29H34N2O7
Mol. Mass.522.5895
SMILESCC(C)(C)OC(=O)N[C@H](Cc1c[nH]c2ccccc12)C(=O)O[C@@H]1CO[C@@H]2[C@@H](CO[C@H]12)OCc1ccccc1