Reaction Details
TargetKallikrein-5 [D153N]
LigandBDBM50446225
Substrate/Competitorn/a
Meas. Tech.ChEMBL_1288000 (CHEMBL3110699)
IC50 222900±n/a nM
Citation Oliveira, JPFreitas, RFMelo, LSBarros, TGSantos, JAJuliano, MAPinheiro, SBlaber, MJuliano, LMuri, EMPuzer, L Isomannide-based peptidomimetics as inhibitors for human tissue kallikreins 5 and 7. ACS Med Chem Lett5:128-32 (2014) 
 
Kallikrein-5 [D153N]
Name:Kallikrein-5 [D153N]
Type:PROTEIN
Mol. Mass.:32031.75
Organism:Homo sapiens (Human)
Description:ChEMBL_1282456
Residue:293
BDBM50446225
NameBDBM50446225
Synonyms:CHEMBL3109159
TypeSmall organic molecule
Emp. Form.C23H33NO7
Mol. Mass.435.5106
SMILESCC(C)[C@@H](NC(=O)OC(C)(C)C)C(=O)O[C@@H]1CO[C@@H]2[C@@H](CO[C@H]12)OCc1ccccc1