Reaction Details
TargetKallikrein-7
LigandBDBM50446227
Substrate/Competitorn/a
Meas. Tech.ChEMBL_1287998 (CHEMBL3110697)
Ki 1800±n/a nM
Citation Oliveira, JPFreitas, RFMelo, LSBarros, TGSantos, JAJuliano, MAPinheiro, SBlaber, MJuliano, LMuri, EMPuzer, L Isomannide-based peptidomimetics as inhibitors for human tissue kallikreins 5 and 7. ACS Med Chem Lett5:128-32 (2014) 
 
Kallikrein-7
Name:Kallikrein-7
Type:PROTEIN
Mol. Mass.:27535.05
Organism:Homo sapiens (Human)
Description:ChEMBL_1469257
Residue:253
BDBM50446227
NameBDBM50446227
Synonyms:CHEMBL3109056
TypeSmall organic molecule
Emp. Form.C27H26N2O5S
Mol. Mass.490.571
SMILESO=C(N[C@H]1CO[C@@H]2[C@@H](CO[C@H]12)OCc1ccccc1)C(\NC(=O)c1ccccc1)=C\c1cccs1