Reaction Details
TargetKallikrein-7
LigandBDBM50446230
Substrate/Competitorn/a
Meas. Tech.ChEMBL_1287998 (CHEMBL3110697)
Ki 4400±n/a nM
Citation Oliveira, JPFreitas, RFMelo, LSBarros, TGSantos, JAJuliano, MAPinheiro, SBlaber, MJuliano, LMuri, EMPuzer, L Isomannide-based peptidomimetics as inhibitors for human tissue kallikreins 5 and 7. ACS Med Chem Lett5:128-32 (2014) 
 
Kallikrein-7
Name:Kallikrein-7
Type:PROTEIN
Mol. Mass.:27535.05
Organism:Homo sapiens (Human)
Description:ChEMBL_1469257
Residue:253
BDBM50446230
NameBDBM50446230
Synonyms:CHEMBL3109059
TypeSmall organic molecule
Emp. Form.C31H38N4O8S
Mol. Mass.626.72
SMILESCc1ccc(cc1)S(=O)(=O)n1cnc(C[C@H](NC(=O)OC(C)(C)C)C(=O)N[C@H]2CO[C@@H]3[C@@H](CO[C@H]23)OCc2ccccc2)c1