Reaction Details
TargetKallikrein-5 [D153N]
LigandBDBM50446211
Substrate/Competitorn/a
Meas. Tech.ChEMBL_1287999 (CHEMBL3110698)
Ki 2400±n/a nM
Citation Oliveira, JPFreitas, RFMelo, LSBarros, TGSantos, JAJuliano, MAPinheiro, SBlaber, MJuliano, LMuri, EMPuzer, L Isomannide-based peptidomimetics as inhibitors for human tissue kallikreins 5 and 7. ACS Med Chem Lett5:128-32 (2014) 
 
Kallikrein-5 [D153N]
Name:Kallikrein-5 [D153N]
Type:PROTEIN
Mol. Mass.:32031.75
Organism:Homo sapiens (Human)
Description:ChEMBL_1282456
Residue:293
BDBM50446211
NameBDBM50446211
Synonyms:CHEMBL3109058
TypeSmall organic molecule
Emp. Form.C32H43N3O8
Mol. Mass.597.6991
SMILESCC(C)(C)OC(=O)N[C@@H](CCCCNC(=O)OCc1ccccc1)C(=O)N[C@H]1CO[C@@H]2[C@@H](CO[C@H]12)OCc1ccccc1