Reaction Details
TargetKallikrein-5 [D153N]
LigandBDBM50446214
Substrate/Competitorn/a
Meas. Tech.ChEMBL_1287999 (CHEMBL3110698)
Ki 28200±n/a nM
Citation Oliveira, JPFreitas, RFMelo, LSBarros, TGSantos, JAJuliano, MAPinheiro, SBlaber, MJuliano, LMuri, EMPuzer, L Isomannide-based peptidomimetics as inhibitors for human tissue kallikreins 5 and 7. ACS Med Chem Lett5:128-32 (2014) 
 
Kallikrein-5 [D153N]
Name:Kallikrein-5 [D153N]
Type:PROTEIN
Mol. Mass.:32031.75
Organism:Homo sapiens (Human)
Description:ChEMBL_1282456
Residue:293
BDBM50446214
NameBDBM50446214
Synonyms:CHEMBL3109170
TypeSmall organic molecule
Emp. Form.C29H35N3O6
Mol. Mass.521.6047
SMILESCC(C)(C)OC(=O)N[C@H](Cc1c[nH]c2ccccc12)C(=O)N[C@H]1CO[C@@H]2[C@@H](CO[C@H]12)OCc1ccccc1