Reaction Details
TargetKallikrein-5 [D153N]
LigandBDBM50446224
Substrate/Competitorn/a
Meas. Tech.ChEMBL_1287999 (CHEMBL3110698)
Ki 2400±n/a nM
Citation Oliveira, JPFreitas, RFMelo, LSBarros, TGSantos, JAJuliano, MAPinheiro, SBlaber, MJuliano, LMuri, EMPuzer, L Isomannide-based peptidomimetics as inhibitors for human tissue kallikreins 5 and 7. ACS Med Chem Lett5:128-32 (2014) 
 
Kallikrein-5 [D153N]
Name:Kallikrein-5 [D153N]
Type:PROTEIN
Mol. Mass.:32031.75
Organism:Homo sapiens (Human)
Description:ChEMBL_1282456
Residue:293
BDBM50446224
NameBDBM50446224
Synonyms:CHEMBL3109160
TypeSmall organic molecule
Emp. Form.C28H35NO8
Mol. Mass.513.5794
SMILESCC(C)(C)OC(=O)N[C@H](COCc1ccccc1)C(=O)O[C@@H]1CO[C@@H]2[C@@H](CO[C@H]12)OCc1ccccc1