Reaction Details
TargetKallikrein-7
LigandBDBM50446221
Substrate/Competitorn/a
Meas. Tech.ChEMBL_1287998 (CHEMBL3110697)
Ki 2800±n/a nM
Citation Oliveira, JPFreitas, RFMelo, LSBarros, TGSantos, JAJuliano, MAPinheiro, SBlaber, MJuliano, LMuri, EMPuzer, L Isomannide-based peptidomimetics as inhibitors for human tissue kallikreins 5 and 7. ACS Med Chem Lett5:128-32 (2014) 
 
Kallikrein-7
Name:Kallikrein-7
Type:PROTEIN
Mol. Mass.:27535.05
Organism:Homo sapiens (Human)
Description:ChEMBL_1469257
Residue:253
BDBM50446221
NameBDBM50446221
Synonyms:CHEMBL3109163
TypeSmall organic molecule
Emp. Form.C35H38N2O8
Mol. Mass.614.6848
SMILESO=C(O[C@@H]1CO[C@@H]2[C@@H](CO[C@H]12)OCc1ccccc1)[C@H](Cc1ccccc1)NC(=O)[C@@H]1CCCN1C(=O)OCc1ccccc1