Reaction Details
TargetNitric oxide synthase, endothelial
LigandBDBM50446249
Substrate/Competitorn/a
Meas. Tech.ChEMBL_1288016 (CHEMBL3110715)
Ki 2356±n/a nM
Citation Jing, QLi, HRoman, LJMartásek, PPoulos, TLSilverman, RB An Accessible Chiral Linker to Enhance Potency and Selectivity of Neuronal Nitric Oxide Synthase Inhibitors. ACS Med Chem Lett5:56-60 (2014) 
 
Nitric oxide synthase, endothelial
Name:Nitric oxide synthase, endothelial
Type:Enzyme
Mol. Mass.:133292.26
Organism:Bos taurus (bovine)
Description:Recombinant eNOS overexpressed in E. coli was used in enzyme assays.
Residue:1205
BDBM50446249
NameBDBM50446249
Synonyms:CHEMBL3109189 | US9732037, Compound 8
TypeSmall organic molecule
Emp. Form.C19H27N5O2
Mol. Mass.357.45
SMILESCc1cc(N)nc(COC[C@@H]2C[C@@H](CN2)OCc2cc(C)cc(N)n2)c1