Reaction Details
TargetPlatelet-derived growth factor receptor beta
LigandBDBM50446303
Substrate/Competitorn/a
Meas. Tech.ChEMBL_1286755 (CHEMBL3111860)
IC50 55±n/a nM
Citation Hicken, EJMarmsater, FPMunson, MCSchlachter, STRobinson, JEAllen, SBurgess, LEDeLisle, RKRizzi, JPTopalov, GTZhao, QHicks, JMKallan, NCTarlton, EAllen, ACallejo, MCox, ARana, SKlopfenstein, NWoessner, RLyssikatos, JP Discovery of a Novel Class of Imidazo[1,2-a]Pyridines with Potent PDGFR Activity and Oral Bioavailability. ACS Med Chem Lett5:78-83 (2014) 
 
Platelet-derived growth factor receptor beta
Name:Platelet-derived growth factor receptor beta
Type:Enzyme
Mol. Mass.:122771.00
Organism:Mus musculus (mouse)
Description:P05622
Residue:1098
BDBM50446303
NameBDBM50446303
Synonyms:CHEMBL3109338
TypeSmall organic molecule
Emp. Form.C24H25FN4O3
Mol. Mass.436.4787
SMILESCOCCOc1ccn2c(cnc2c1)-c1ccc2cccc(O[C@H]3CCNC[C@@H]3F)c2n1