Reaction Details
TargetPlatelet-derived growth factor receptor beta
LigandBDBM50446306
Substrate/Competitorn/a
Meas. Tech.ChEMBL_1286760 (CHEMBL3111865)
IC50 3.0±n/a nM
Citation Hicken, EJMarmsater, FPMunson, MCSchlachter, STRobinson, JEAllen, SBurgess, LEDeLisle, RKRizzi, JPTopalov, GTZhao, QHicks, JMKallan, NCTarlton, EAllen, ACallejo, MCox, ARana, SKlopfenstein, NWoessner, RLyssikatos, JP Discovery of a Novel Class of Imidazo[1,2-a]Pyridines with Potent PDGFR Activity and Oral Bioavailability. ACS Med Chem Lett5:78-83 (2014) 
 
Platelet-derived growth factor receptor beta
Name:Platelet-derived growth factor receptor beta
Type:Enzyme
Mol. Mass.:122771.00
Organism:Mus musculus (mouse)
Description:P05622
Residue:1098
BDBM50446306
NameBDBM50446306
Synonyms:CHEMBL3109340
TypeSmall organic molecule
Emp. Form.C24H26N4O3
Mol. Mass.418.4882
SMILESCOCCOc1ccn2c(cnc2c1)-c1ccc2cccc(OC3CCNCC3)c2n1