Reaction Details
TargetPlatelet-derived growth factor receptor beta
LigandBDBM50446307
Substrate/Competitorn/a
Meas. Tech.ChEMBL_1286760 (CHEMBL3111865)
IC50 176±n/a nM
Citation Hicken, EJMarmsater, FPMunson, MCSchlachter, STRobinson, JEAllen, SBurgess, LEDeLisle, RKRizzi, JPTopalov, GTZhao, QHicks, JMKallan, NCTarlton, EAllen, ACallejo, MCox, ARana, SKlopfenstein, NWoessner, RLyssikatos, JP Discovery of a Novel Class of Imidazo[1,2-a]Pyridines with Potent PDGFR Activity and Oral Bioavailability. ACS Med Chem Lett5:78-83 (2014) 
 
Platelet-derived growth factor receptor beta
Name:Platelet-derived growth factor receptor beta
Type:Enzyme
Mol. Mass.:122771.00
Organism:Mus musculus (mouse)
Description:P05622
Residue:1098
BDBM50446307
NameBDBM50446307
Synonyms:CHEMBL3109355
TypeSmall organic molecule
Emp. Form.C21H22N4O3
Mol. Mass.378.4244
SMILESCOCCOc1ccn2c(cnc2c1)-c1ccc2cccc(OCCN)c2n1