Reaction Details
TargetProteinase-activated receptor 1
LigandBDBM50446334
Substrate/Competitorn/a
Meas. Tech.ChEMBL_1286966 (CHEMBL3111131)
Ki 15±n/a nM
Citation Chelliah, MVChackalamannil, SXia, YGreenlee, WJAhn, HSKurowski, SBoykow, GHsieh, YChintala, M Himbacine-derived thrombin receptor antagonists: c7-aminomethyl and c9a-hydroxy analogues of vorapaxar. ACS Med Chem Lett5:183-7 (2014) 
 
Proteinase-activated receptor 1
Name:Proteinase-activated receptor 1
Type:Protein
Mol. Mass.:47450.07
Organism:Homo sapiens (Human)
Description:P25116
Residue:425
BDBM50446334
NameBDBM50446334
Synonyms:CHEMBL3109588
TypeSmall organic molecule
Emp. Form.C28H33FN2O4S
Mol. Mass.512.636
SMILESC[C@H]1OC(=O)[C@@H]2C[C@@H]3C[C@H](CNS(C)(=O)=O)CC[C@H]3[C@H](\C=C\c3ccc(cn3)-c3cccc(F)c3)[C@H]12